{"text_format":"1","workbook":"xlsx","n_sheets":2,"sheets":["Sheet1","Sheet2"],"not_rendered":{"charts":0,"images":0,"macros":1,"external_links":0,"defined_names":0,"comments":0,"pivot_tables":0},"unopened":[],"bounds":{"document_bytes":16777216,"sheet_cells":100000,"rows_first":2000,"rows_last":500,"rows_between":2000,"halvings":0,"cell_chars":16384,"cell_head_chars":4096},"cells_cut":0,"cells_raw":0,"read":"whole","date_system":"1900"}

{"sheet":"Sheet1","index":0,"n_rows":27,"n_cols":21,"rows_kept":27,"cut":false,"hidden":false,"merged":[[26,19,27,19],[26,20,27,20],[22,20,23,20],[24,16,25,16],[24,17,25,17],[24,18,25,18],[24,19,25,19],[24,20,25,20],[18,20,19,20],[20,16,21,16],[20,17,21,17],[20,18,21,18],[20,19,21,19],[20,20,21,20],[14,20,15,20],[16,16,17,16],[16,17,17,17],[16,18,17,18],[16,19,17,19],[16,20,17,20],[12,3,30,9],[14,16,15,16],[14,17,15,17],[14,18,15,18],[14,19,15,19],[18,16,19,16],[18,17,19,17],[18,18,19,18],[18,19,19,19],[22,16,23,16],[22,17,23,17],[22,18,23,18],[22,19,23,19],[26,16,27,16],[26,17,27,17],[26,18,27,18]]}
[]
[]
[]
[]
[]
[]
[]
[]
[]
[]
[]
[]
[null,null,null,{"$f":"INT(RAND()*15)+1","v":9}]
[]
[null,null,null,null,null,null,null,null,null,null,null,null,null,null,null,null,null,"추첨번호","소속 대학","소속학과(부)","이름"]
[]
[null,null,null,null,null,null,null,null,null,null,null,null,null,null,null,null,"1등",8,{"$f":"VLOOKUP(R17,Sheet2!$A$2:$E$16,3,TRUE)","v":"숭실대학교"},{"$f":"VLOOKUP($R17,Sheet2!$A$2:$E$16,4,TRUE)","v":"물리학과"},{"$f":"VLOOKUP($R17,Sheet2!$A$2:$E$16,5,TRUE)","v":"김XX"}]
[]
[null,null,null,null,null,null,null,null,null,null,null,null,null,null,null,null,"2등",9,{"$f":"VLOOKUP(R19,Sheet2!$A$2:$E$16,3,TRUE)","v":"숭실대학교"},{"$f":"VLOOKUP($R19,Sheet2!$A$2:$E$16,4,TRUE)","v":"물리학과"},{"$f":"VLOOKUP($R19,Sheet2!$A$2:$E$16,5,TRUE)","v":"신XX"}]
[]
[null,null,null,null,null,null,null,null,null,null,null,null,null,null,null,null,"3등-1",13,{"$f":"VLOOKUP(R21,Sheet2!$A$2:$E$16,3,TRUE)","v":"한국과학기술원"},{"$f":"VLOOKUP($R21,Sheet2!$A$2:$E$16,4,TRUE)","v":"항공우주공학과"},{"$f":"VLOOKUP($R21,Sheet2!$A$2:$E$16,5,TRUE)","v":"박XX"}]
[]
[null,null,null,null,null,null,null,null,null,null,null,null,null,null,null,null,"3등-2",14,{"$f":"VLOOKUP(R23,Sheet2!$A$2:$E$16,3,TRUE)","v":"한국해양대학교"},{"$f":"VLOOKUP($R23,Sheet2!$A$2:$E$16,4,TRUE)","v":"나노반도체공학과"},{"$f":"VLOOKUP($R23,Sheet2!$A$2:$E$16,5,TRUE)","v":"이XX"}]
[]
[null,null,null,null,null,null,null,null,null,null,null,null,null,null,null,null,"3등-3",7,{"$f":"VLOOKUP(R25,Sheet2!$A$2:$E$16,3,TRUE)","v":"성균관대학교"},{"$f":"VLOOKUP($R25,Sheet2!$A$2:$E$16,4,TRUE)","v":"시스템경영공학과"},{"$f":"VLOOKUP($R25,Sheet2!$A$2:$E$16,5,TRUE)","v":"권XX"}]
[]
[null,null,null,null,null,null,null,null,null,null,null,null,null,null,null,null,"3등-4",12,{"$f":"VLOOKUP(R27,Sheet2!$A$2:$E$16,3,TRUE)","v":"포항공과대학교"},{"$f":"VLOOKUP($R27,Sheet2!$A$2:$E$16,4,TRUE)","v":"산업경영공학과"},{"$f":"VLOOKUP($R27,Sheet2!$A$2:$E$16,5,TRUE)","v":"오XX"}]

{"sheet":"Sheet2","index":1,"n_rows":16,"n_cols":5,"rows_kept":16,"cut":false,"hidden":false,"merged":[]}
["No.","User Email ID","소속 대학","소속학과(부)","이름"]
[1,null,"건국대학교","전자공학부","박XX"]
[2,null,"경희대학교","전자전파공학과","이XX"]
[3,null,"경희대학교","전자전파공학과","박XX"]
[4,null,"서울대학교","전기정보공학부","전XX"]
[5,null,"성균관대학교","컴퓨터공학과","하XX"]
[6,null,"성균관대학교","전자전기공학부","김XX"]
[7,null,"성균관대학교","시스템경영공학과","권XX"]
[8,null,"숭실대학교","물리학과","김XX"]
[9,null,"숭실대학교","물리학과","신XX"]
[10,null,"연세대학교","전기전자공학부","이XX"]
[11,null,"중앙대학교","전자전기공학부","최XX"]
[12,null,"포항공과대학교","산업경영공학과","오XX"]
[13,null,"한국과학기술원","항공우주공학과","박XX"]
[14,null,"한국해양대학교","나노반도체공학과","이XX"]
[15,null,"한양대학교","기계공학부","박XX"]